Dies ist der Cache von Google von https://bugs.archlinux32.org/index.php?string=io. Es handelt sich dabei um ein Abbild der Seite, wie diese am 17. Sept. 2019 17:26:37 GMT angezeigt wurde. Die aktuelle Seite sieht mittlerweile eventuell anders aus. Weitere Informationen.
Vollständige VersionNur-Text-VersionQuelle anzeigen
Tipp: Um deinen Suchbegriff schnell auf dieser Seite zu finden, drücke Strg+F bzw. ⌘-F (Mac) und verwende die Suchleiste.
Flyspray::Archlinux32: Tasklist
IDCategoryTask TypePrioritySeveritySummaryStatusProgress
20Packages: Build-listBug ReportMediumLow[sagemath-doc] building documentation using Sphinx segf...New
Task Description
[tutorial ] Saved pickle file: citations.pickle
[tutorial ] Exception occurred:
[tutorial ] File "/usr/lib/python2.7/site-packages/sphinx/environment/__init__.py", line 152, in dump
[tutorial ] pickle.dump(env, f, pickle.HIGHEST_PROTOCOL)
[tutorial ] MemoryError
[tutorial ] The full traceback has been saved in /tmp/sphinx-err-kSNZ9A.log, if you want to report the issue to the developers.
[tutorial ] Please also report this if it was a user error, so that a better error message can be provided next time.
[tutorial ] A bug report can be filed in the tracker at . Thanks!
Build finished. The built documents can be found in /build/sagemath-doc/src/sage-8.1/src/doc/html/ja/tutorial
/startdir/PKGBUILD: line 79:  2540 Segmentation fault      (core dumped) python2 sage_setup/docbuild --no-pdf-links -k all html
==> ERROR: A failure occurred in build().
==> ERROR: Build failed, check /data/archbuild/staging-i686/copy/build
39Packages: TestingBug ReportMediumLowxorg modesetting module fails with illegal instructionNew
Task Description
[    22.717] (EE) Illegal instruction at address 0xb632cd37
[    22.718] (EE) 
Fatal server error:
[    22.718] (EE) Caught signal 4 (Illegal instruction). Server aborting
[    22.719] (EE) 

                 PID: 242 (Xorg)
           UID: 0 (root)
           GID: 0 (root)
        Signal: 6 (ABRT)
     Timestamp: Wed 2018-06-13 20:53:43 CEST (41s ago)
  Command Line: /usr/lib/Xorg :0
    Executable: /usr/lib/Xorg
 Control Group: /user.slice/user-0.slice/session-c1.scope
          Unit: session-c1.scope
         Slice: user-0.slice
       Session: c1
     Owner UID: 0 (root)
       Boot ID: ea12301d13874fac8112dad7bf566bdb
    Machine ID: 2f98089cbe8d40cb8776a580d6803b58
      Hostname: arch32-staging
       Storage: /var/lib/systemd/coredump/core.Xorg.0.ea12301d13874fac8112dad7bf566bdb.242.1528916023000>
       Message: Process 242 (Xorg) of user 0 dumped core.
                Stack trace of thread 242:
                #0  0x00000000b7f58d21 __kernel_vsyscall (linux-gate.so.1)
                #1  0x00000000b7d749c2 raise (libc.so.6)
                #2  0x00000000b7d5e71e abort (libc.so.6)
                #3  0x000000000056b555 OsAbort (Xorg)
                #4  0x000000000056b5d2 FatalError (Xorg)
                #5  0x000000000060a93a n/a (Xorg)
                #6  0x00000000b7f58d38 __kernel_rt_sigreturn (linux-gate.so.1)
                #7  0x00000000b632cd37 n/a (kms_swrast_dri.so)
                #8  0x00000000b5f0181f n/a (kms_swrast_dri.so)
                #9  0x00000000b7f698b3 call_init.part.0 (ld-linux.so.2)
                #10 0x00000000b7f699b2 _dl_init (ld-linux.so.2)
                #11 0x00000000b7f6d7e0 dl_open_worker (ld-linux.so.2)
                #12 0x00000000b7e7bc91 _dl_catch_exception (libc.so.6)
                #13 0x00000000b7f6d077 _dl_open (ld-linux.so.2)
                #14 0x00000000b7b8cb73 n/a (libdl.so.2)
                #15 0x00000000b7e7bc91 _dl_catch_exception (libc.so.6)
                #16 0x00000000b7e7bd40 _dl_catch_error (libc.so.6)
                #17 0x00000000b7b8d333 n/a (libdl.so.2)
                #18 0x00000000b7b8cc16 dlopen (libdl.so.2)
                #19 0x00000000b7f2eb6e n/a (libgbm.so.1)
                #20 0x00000000b7f2ecb3 n/a (libgbm.so.1)
                #21 0x00000000b7f2ee24 n/a (libgbm.so.1)
                #22 0x00000000b7f2f0d7 n/a (libgbm.so.1)
                #23 0x00000000b7f2c9ba gbm_create_device (libgbm.so.1)
                #24 0x00000000b6ef4ee4 glamor_egl_init (libglamoregl.so)
                #25 0x00000000b7f49b4a n/a (modesetting_drv.so)
                #26 0x000000000051c169 InitOutput (Xorg)
                #27 0x000000000049d8e1 n/a (Xorg)
                #28 0x00000000b7d60041 __libc_start_main (libc.so.6)
                #29 0x000000000049e7e2 _start (Xorg)
43Packages: Build-listBug ReportMediumLowqt5-webengine, firefox, firefox-developer-edition use t...New
Task Description
In file included from gen/third_party/WebKit/public/platform/modules/presentation/presentation.mojom-shared.h:24,
                 from gen/third_party/WebKit/public/platform/modules/presentation/presentation.mojom.h:37,
                 from ../../../../qtwebengine-everywhere-src-5.11.0/src/3rdparty/chromium/content/browser/frame_host/render_frame_host_impl.h:66,
                 from ../../../../qtwebengine-everywhere-src-5.11.0/src/3rdparty/chromium/content/browser/frame_host/frame_tree_node.h:18,
                 from ../../../../qtwebengine-everywhere-src-5.11.0/src/3rdparty/chromium/content/browser/devtools/browser_devtools_agent_host.cc:21:
gen/third_party/WebKit/public/platform/modules/presentation/presentation.mojom-shared-internal.h:139:35: warning: alignment 1 of ‘blink::mojom::internal::PresentationConnectionMessage_Data’ is less than 8 [-Wpacked-not-aligned]
 class MOJOM_SHARED_CONTENT_EXPORT PresentationConnectionMessage_Data {
virtual memory exhausted: Cannot allocate memory
ninja: build stopped: subcommand failed.

Also in firefox:

91:37.06 ../../build/unix/gold/ld: fatal error: libxul.so: mmap: failed to allocate 1703955732 bytes for output file: Cannot allocate memory
91:37.06 collect2: error: ld returned 1 exit status
91:37.06 make[4]: *** [/build/firefox/src/mozilla-unified/config/rules.mk:701: libxul.so] Error 1
91:37.06 make[3]: *** [/build/firefox/src/mozilla-unified/config/recurse.mk:73: toolkit/library/target] Error 2
91:37.06 make[2]: *** [/build/firefox/src/mozilla-unified/config/recurse.mk:33: compile] Error 2
91:37.06 make[1]: *** [/build/firefox/src/mozilla-unified/config/rules.mk:434: default] Error 2
91:37.06 make: *** [client.mk:168: build] Error 2
65Packages: StableBug ReportVery LowLow[qt5-styleplugins] incompatile QT versionUnconfirmed
Task Description

i can not get any QT program to start while that is installed - they complain about mixed QT versions

it looks like qt5-styleplugins was built with the [testing] repo enabled, with qt5-base-5.12.2, while other QT-base programs were built against qt5-base-5.12.1

73Packages: StableBug ReportVery LowLow[gajim] fails to launch when (optional) gupnp-igd is in...Unconfirmed
Task Description
$ gajim
No translations found
Dirs searched: [PosixPath('/usr/local/share'), PosixPath('/usr/share'), PosixPath('/usr/share/gdm'), PosixPath('/var/lib/menu-xdg')]

(gajim:1588): dbind-WARNING **: 15:14:29.481: Couldn't connect to accessibility bus: Failed to connect to socket /tmp/dbus-Nv1LTXmb8O: Connection refused

** (gajim:1588): WARNING **: 15:14:29.534: Failed to load shared library 'libgupnp-igd-1.0.so.4' referenced by the typelib: libgupnp-1.2.so.0: cannot open shared object file: No such file or directory
/usr/lib/python3.7/site-packages/gajim/common/app.py:281: Warning: cannot retrieve class for invalid (unclassed) type 'void'
  gupnp_igd = GUPnPIgd.SimpleIgd()
Traceback (most recent call last):
  File "/usr/lib/python3.7/site-packages/gajim/application.py", line 185, in _startup
  File "/usr/lib/python3.7/site-packages/gajim/common/app.py", line 281, in detect_dependencies
    gupnp_igd = GUPnPIgd.SimpleIgd()
TypeError: could not get a reference to type class
Traceback (most recent call last):
  File "/usr/lib/python3.7/site-packages/gajim/application.py", line 220, in _activate
    self.interface = Interface()
  File "/usr/lib/python3.7/site-packages/gajim/gui_interface.py", line 2615, in __init__
    cfg_was_read = parser.read()
  File "/usr/lib/python3.7/site-packages/gajim/common/optparser.py", line 86, in read
    self.update_config(old_version, new_version)
  File "/usr/lib/python3.7/site-packages/gajim/common/optparser.py", line 158, in update_config
AttributeError: 'NoneType' object has no attribute 'initialize_from_db'
Traceback (most recent call last):
  File "/usr/lib/python3.7/site-packages/gajim/application.py", line 269, in do_shutdown
AttributeError: 'NoneType' object has no attribute 'commit'
78Release EngineeringBug ReportVery LowCriticalThe qt5 group contains packages of different versions.Unconfirmed
Task Description

The qt5 group contains a qt5-base which is of a later revision, 5.12.4 instead of 5.12.3. pyside2 is also of a this later revision, but I don’t use it. I guess the group should be fixed.

Workaround: I downgraded qt5-base and it is working again.

I get this error: sddm-greeter[441]: Cannot mix incompatible Qt library (version 0x50c03) with this library (version 0x50c04)
Then systemd dumps core.

Excerpt from my journal: External Link

The group definition as seen when installing the group with pacman: External Link

My architecture is i686.

I consider it critical since QT is not working.

86Packages: StableBug ReportMediumLownewsboat contains SSE2 instuctionsNew
Task Description

shell> newsboat

Program received signal SIGILL, Illegal instruction.
0x005f5cd9 in ?? ()
=> 0x005f5cd9:  f2 0f 10 06     movsd  (%esi),%xmm0
(gdb) bt
#0  0x005f5cd9 in ?? ()
#1  0x005f40fa in ?? ()
#2  0x005f3f3b in ?? ()
#3  0x0072e9fd in ?? ()
#4  0x00661600 in ?? ()
#5  0x00659435 in ?? ()
#6  0x0061fe88 in ?? ()
#7  0x0065770c in ?? ()
#8  0x005ea416 in ?? ()
#9  0x0044ca68 in ?? ()
#10 0xb76f9859 in __libc_start_main () from /usr/lib/libc.so.6
#11 0x0044da75 in ?? ()

This actually looks like glibc got a SSE2 infection on i686.

Showing tasks 1 - 7 of 7 Page 1 of 1

Available keyboard shortcuts

  • SHIFT+ALT+l Login Dialog / Logout
  • SHIFT+ALT+a Add new task
  • SHIFT+ALT+m My searches
  • SHIFT+ALT+t focus taskid search


  • o open selected task
  • j move cursor down
  • k move cursor up

Task Details

  • n Next task
  • p Previous task
  • SHIFT+ALT+e ENTER Edit this task
  • SHIFT+ALT+y Close Task

Task Editing

  • SHIFT+ALT+s save task